reinsure-v
type: LexicalEntry
canonical form: reinsure
sense: 00893062-v
part of speech: verb

00893062-v
type: LexicalConcept
in scheme: en-word.net
definition: insure again by assuming all or a part of the liability of an insurance company already covering a risk
ili: i26076
lexfile: verb.communication
part of speech: verb
hypernym: 00892737-v