profess-v
type: LexicalEntry
canonical form: profess
sense: 00890178-v
part of speech: verb

00890178-v
type: LexicalConcept
in scheme: en-word.net
definition: receive into a religious order or congregation
ili: i26063
lexfile: verb.communication
part of speech: verb
hypernym: 02241406-v
similar: 00889847-v