watch-n
type: LexicalEntry
canonical form: watch
sense: 00882340-n
part of speech: noun

vigil-n
type: LexicalEntry
canonical form: vigil
sense: 00882340-n
part of speech: noun

00882340-n
type: LexicalConcept
in scheme: en-word.net
definition: a purposeful surveillance to guard or observe
ili: i40025
lexfile: noun.act
part of speech: noun
hypernym: 00653709-n