estimate-n
type: LexicalEntry
canonical form: estimate
sense: 00876924-n
part of speech: noun

estimation-n
type: LexicalEntry
canonical form: estimation
sense: 00876924-n
part of speech: noun

00876924-n
type: LexicalConcept
in scheme: en-word.net
definition: a judgment of the qualities of something or somebody
example: many factors are involved in any estimate of human life
example: in my estimation the boy is innocent
ili: i39994
lexfile: noun.act
part of speech: noun
hypernym: 00875745-n