exponentiation-n
type: LexicalEntry
canonical form: exponentiation
sense: 00874089-n
part of speech: noun

involution-n
type: LexicalEntry
canonical form: involution
sense: 00874089-n
part of speech: noun

00874089-n
type: LexicalConcept
in scheme: en-word.net
definition: the process of raising a quantity to some assigned power
ili: i39979
lexfile: noun.act
part of speech: noun
hypernym: 00871261-n