passage-n
type: LexicalEntry
canonical form: passage
sense: 00867278-n
part of speech: noun

passing-n
type: LexicalEntry
canonical form: passing
sense: 00867278-n
part of speech: noun

00867278-n
type: LexicalConcept
in scheme: en-word.net
definition: a bodily reaction of changing from one place or stage to another
example: the passage of air from the lungs
example: the passing of flatus
ili: i39947
lexfile: noun.act
part of speech: noun
hypernym: 00860679-n