bombard-v
type: LexicalEntry
canonical form: bombard
sense: 00865243-v
part of speech: verb

barrage-v
type: LexicalEntry
canonical form: barrage
sense: 00865243-v
part of speech: verb

00865243-v
type: LexicalConcept
in scheme: en-word.net
definition: address with continuously or persistently, as if with a barrage
example: The speaker was barraged by an angry audience
example: The governor was bombarded with requests to grant a pardon to the convicted killer
ili: i25947
lexfile: verb.communication
part of speech: verb
hypernym: 00864347-v