rip-v
type: LexicalEntry
canonical form: rip
sense: 00864941-v
part of speech: verb

00864941-v
type: LexicalConcept
in scheme: en-word.net
definition: criticize or abuse strongly and violently
example: The candidate ripped into his opponent mercilessly
ili: i25945
lexfile: verb.communication
part of speech: verb
hypernym: 00864347-v