feel-n
type: LexicalEntry
canonical form: feel
sense: 00856168-n
part of speech: noun

00856168-n
type: LexicalConcept
in scheme: en-word.net
definition: manual stimulation of the genital area for sexual pleasure
example: the girls hated it when he tried to sneak a feel
ili: i39886
lexfile: noun.act
part of speech: noun
hypernym: 00855465-n