potation-n
type: LexicalEntry
canonical form: potation
sense: 00845236-n
part of speech: noun

00845236-n
type: LexicalConcept
in scheme: en-word.net
definition: the act of drinking (especially an alcoholic drink)
ili: i39837
lexfile: noun.act
part of speech: noun
hypernym: 00844789-n