tutor-v
type: LexicalEntry
canonical form: tutor
sense: 00831849-v
part of speech: verb

00831849-v
type: LexicalConcept
in scheme: en-word.net
definition: be a tutor to someone; give individual instruction
example: She tutored me in Spanish
ili: i25803
lexfile: verb.communication
part of speech: verb
hypernym: 00830768-v