dressing-n
type: LexicalEntry
canonical form: dressing
sense: 00830523-n
part of speech: noun

00830523-n
type: LexicalConcept
in scheme: en-word.net
definition: processes in the conversion of rough hides into leather
ili: i39762
lexfile: noun.act
part of speech: noun
hypernym: 00400891-n