covering-n
type: LexicalEntry
canonical form: covering
sense: 00829743-n
part of speech: noun

00829743-n
type: LexicalConcept
in scheme: en-word.net
definition: the act of protecting something by covering it
ili: i39757
lexfile: noun.act
part of speech: noun
hypernym: 00819341-n