attest-v
type: LexicalEntry
canonical form: attest
sense: 00822013-v
part of speech: verb

00822013-v
type: LexicalConcept
in scheme: en-word.net
definition: authenticate, affirm to be true, genuine, or correct, as in an official capacity
example: I attest this signature
ili: i25762
lexfile: verb.communication
part of speech: verb
hypernym: 01013058-v
similar: 00822272-v