new-a
type: LexicalEntry
canonical form: new
sense: 00821577-s
part of speech: adjective

young-a
type: LexicalEntry
canonical form: young
sense: 00821577-s
part of speech: adjective

00821577-s
type: LexicalConcept
in scheme: en-word.net
definition: (of crops) harvested at an early stage of development; before complete maturity
example: new potatoes
example: young corn
ili: i4502
lexfile: adj.all
part of speech: adjective satellite
similar: https://en-word.net/synset/00820993-a