conservation-n
type: LexicalEntry
canonical form: conservation
sense: 00820935-n
part of speech: noun

00820935-n
type: LexicalConcept
in scheme: en-word.net
definition: the preservation and careful management of the environment and of natural resources
ili: i39708
lexfile: noun.act
part of speech: noun
hypernym: 00820685-n