insist-v
type: LexicalEntry
canonical form: insist
sense: 00820635-v
part of speech: verb

take a firm stand-v
type: LexicalEntry
canonical form: take a firm stand
sense: 00820635-v
part of speech: verb

00820635-v
type: LexicalConcept
in scheme: en-word.net
definition: be emphatic or resolute and refuse to budge
example: I must insist!
ili: i25755
lexfile: verb.communication
part of speech: verb
hypernym: 00630153-v