blaspheme-v
type: LexicalEntry
canonical form: blaspheme
sense: 00816120-v
part of speech: verb

00816120-v
type: LexicalConcept
in scheme: en-word.net
definition: speak of in an irreverent or impious manner
example: blaspheme God
ili: i25734
lexfile: verb.communication
part of speech: verb
hypernym: 00945595-v
similar: 00867051-v