shun-v
type: LexicalEntry
canonical form: shun
sense: 00813811-v
part of speech: verb

eschew-v
type: LexicalEntry
canonical form: eschew
sense: 00813811-v
part of speech: verb

00813811-v
type: LexicalConcept
in scheme: en-word.net
definition: avoid and stay away from deliberately; stay clear of
ili: i25725
lexfile: verb.communication
part of speech: verb
hypernym: 00813037-v