possession-n
type: LexicalEntry
canonical form: possession
sense: 00811363-n
part of speech: noun

00811363-n
type: LexicalConcept
in scheme: en-word.net
definition: (sport) the act of controlling the ball (or puck)
example: they took possession of the ball on their own goal line
ili: i39660
lexfile: noun.act
part of speech: noun
domain topic: 00524569-n
hypernym: 00805278-n