drab-a
type: LexicalEntry
canonical form: drab
sense: 00810969-s
part of speech: adjective

dreary-a
type: LexicalEntry
canonical form: dreary
sense: 00810969-s
part of speech: adjective

00810969-s
type: LexicalConcept
in scheme: en-word.net
definition: lacking in liveliness or charm or surprise
example: her drab personality
example: life was drab compared with the more exciting life style overseas
example: a series of dreary dinner parties
ili: i4448
lexfile: adj.all
part of speech: adjective satellite
similar: https://en-word.net/synset/00810082-a