blunt-a
type: LexicalEntry
canonical form: blunt
sense: 00804035-s
part of speech: adjective

00804035-s
type: LexicalConcept
in scheme: en-word.net
definition: used of a knife or other blade; not sharp
example: a blunt instrument
ili: i4406
lexfile: adj.all
part of speech: adjective satellite
similar: https://en-word.net/synset/00803819-a