assignment-n
type: LexicalEntry
canonical form: assignment
sense: 00798247-n
part of speech: noun

00798247-n
type: LexicalConcept
in scheme: en-word.net
definition: an undertaking that you have been assigned to do (as by an instructor)
ili: i39590
lexfile: noun.act
part of speech: noun
hypernym: 00797381-n