reserve-v
type: LexicalEntry
canonical form: reserve
sense: 00797294-v
part of speech: verb

00797294-v
type: LexicalConcept
in scheme: en-word.net
definition: obtain or arrange (for oneself) in advance
example: We managed to reserve a table at Maxim's
ili: i25657
lexfile: verb.communication
part of speech: verb
hypernym: 00754770-v
similar: 02503969-v