scramble-n
type: LexicalEntry
canonical form: scramble
sense: 00791052-n
part of speech: noun

scuffle-n
type: LexicalEntry
canonical form: scuffle
sense: 00791052-n
part of speech: noun

00791052-n
type: LexicalConcept
in scheme: en-word.net
definition: an unceremonious and disorganized struggle
ili: i39556
lexfile: noun.act
part of speech: noun
hypernym: 00790634-n