protection-n
type: LexicalEntry
canonical form: protection
sense: 00786409-n
part of speech: noun

tribute-n
type: LexicalEntry
canonical form: tribute
sense: 00786409-n
part of speech: noun

00786409-n
type: LexicalConcept
in scheme: en-word.net
definition: payment extorted by gangsters on threat of violence
example: every store in the neighborhood had to pay him protection
ili: i39531
lexfile: noun.act
part of speech: noun
hypernym: 00786042-n