assure-v
type: LexicalEntry
canonical form: assure
sense: 00778313-v
part of speech: verb

00778313-v
type: LexicalConcept
in scheme: en-word.net
definition: assure somebody of the truth of something with the intention of giving the listener confidence
example: I assured him that traveling to Cambodia was safe
ili: i25570
lexfile: verb.communication
part of speech: verb
hypernym: 00768463-v