treat-v
type: LexicalEntry
canonical form: treat
sense: 00764765-v
part of speech: verb

00764765-v
type: LexicalConcept
in scheme: en-word.net
definition: engage in negotiations in order to reach an agreement
example: they had to treat with the King
ili: i25507
lexfile: verb.communication
part of speech: verb
hypernym: 00764523-v