purport-v
type: LexicalEntry
canonical form: purport
sense: 00759237-v
part of speech: verb

00759237-v
type: LexicalConcept
in scheme: en-word.net
definition: have the often specious appearance of being, intending, or claiming
example: The letter purports to express people's opinion
ili: i25481
lexfile: verb.communication
part of speech: verb
hypernym: 00758383-v