falsification-n
type: LexicalEntry
canonical form: falsification
sense: 00752233-n
part of speech: noun

falsehood-n
type: LexicalEntry
canonical form: falsehood
sense: 00752233-n
part of speech: noun

00752233-n
type: LexicalConcept
in scheme: en-word.net
definition: the act of rendering something false as by fraudulent changes (of documents or measures etc.) or counterfeiting
ili: i39382
lexfile: noun.act
part of speech: noun
hypernym: 00750872-n