nasty-a
type: LexicalEntry
canonical form: nasty
sense: 00751340-s
part of speech: adjective

tight-a
type: LexicalEntry
canonical form: tight
sense: 00751340-s
part of speech: adjective

00751340-s
type: LexicalConcept
in scheme: en-word.net
definition: exasperatingly difficult to handle or circumvent
example: a nasty problem
example: a good man to have on your side in a tight situation
ili: i4138
lexfile: adj.all
part of speech: adjective satellite
similar: https://en-word.net/synset/00748528-a