abomination-n
type: LexicalEntry
canonical form: abomination
sense: 00746729-n
part of speech: noun

00746729-n
type: LexicalConcept
in scheme: en-word.net
definition: an action that is vicious or vile; an action that arouses disgust or abhorrence
example: his treatment of the children is an abomination
ili: i39352
lexfile: noun.act
part of speech: noun
hypernym: 00746303-n