exercise-n
type: LexicalEntry
canonical form: exercise
sense: 00731217-n
part of speech: noun

example-n
type: LexicalEntry
canonical form: example
sense: 00731217-n
part of speech: noun

00731217-n
type: LexicalConcept
in scheme: en-word.net
definition: a task performed or problem solved in order to develop skill or understanding
example: you must work the examples at the end of each chapter in the textbook
ili: i39268
lexfile: noun.act
part of speech: noun
hypernym: 00730583-n