guard-n
type: LexicalEntry
canonical form: guard
sense: 00729041-n
part of speech: noun

00729041-n
type: LexicalConcept
in scheme: en-word.net
definition: (American football) a position on the line of scrimmage between the center and the tackles
example: guards must be good blockers
ili: i39253
lexfile: noun.act
part of speech: noun
hypernym: 00727351-n