dazzle-v
type: LexicalEntry
canonical form: dazzle
sense: 00727008-v
part of speech: verb

00727008-v
type: LexicalConcept
in scheme: en-word.net
definition: amaze or bewilder, as with brilliant wit or intellect or skill
example: Her arguments dazzled everyone
example: The dancer dazzled the audience with his turns and jumps
ili: i25325
lexfile: verb.cognition
part of speech: verb
hypernym: 00726794-v