beware-v
type: LexicalEntry
canonical form: beware
sense: 00726626-v
part of speech: verb

mind-v
type: LexicalEntry
canonical form: mind
sense: 00726626-v
part of speech: verb

00726626-v
type: LexicalConcept
in scheme: en-word.net
definition: be on one's guard; be cautious or wary about; be alert to
example: Beware of telephone salesmen
ili: i25323
lexfile: verb.cognition
part of speech: verb
hypernym: 02156396-v