flip-v
type: LexicalEntry
canonical form: flip
sense: 00719845-v
part of speech: verb

flip out-v
type: LexicalEntry
canonical form: flip out
sense: 00719845-v
part of speech: verb

00719845-v
type: LexicalConcept
in scheme: en-word.net
definition: react in an excited, delighted, or surprised way
example: he flipped when he heard that he was accepted into Princeton University
ili: i25290
lexfile: verb.cognition
part of speech: verb
hypernym: 00719282-v