find-v
type: LexicalEntry
canonical form: find
sense: 00717144-v
part of speech: verb

feel-v
type: LexicalEntry
canonical form: feel
sense: 00717144-v
part of speech: verb

00717144-v
type: LexicalConcept
in scheme: en-word.net
definition: come to believe on the basis of emotion, intuitions, or indefinite grounds
example: I feel that he doesn't like me
example: I find him to be obnoxious
example: I found the movie rather entertaining
ili: i25279
lexfile: verb.cognition
part of speech: verb
hypernym: 00636134-v
similar: 00974031-v