needy-a
type: LexicalEntry
canonical form: needy
sense: 00714375-s
part of speech: adjective

00714375-s
type: LexicalConcept
in scheme: en-word.net
definition: demanding or needing attention, affection, or reassurance to an excessive degree
ili: i3945
lexfile: adj.all
part of speech: adjective satellite
similar: https://en-word.net/synset/00713705-a