plot-v
type: LexicalEntry
canonical form: plot
sense: 00709957-v
part of speech: verb

00709957-v
type: LexicalConcept
in scheme: en-word.net
definition: plan secretly, usually something illegal
example: They plotted the overthrow of the government
ili: i25246
lexfile: verb.cognition
part of speech: verb
hypernym: 00706456-v