fusion-n
type: LexicalEntry
canonical form: fusion
sense: 00700770-n
part of speech: noun

spinal fusion-n
type: LexicalEntry
canonical form: spinal fusion
sense: 00700770-n
part of speech: noun

00700770-n
type: LexicalConcept
in scheme: en-word.net
definition: correction of an unstable part of the spine by joining two or more vertebrae; usually done surgically but sometimes done by traction or immobilization
ili: i39114
lexfile: noun.act
part of speech: noun
hypernym: 00663770-n