value-v
type: LexicalEntry
canonical form: value
sense: 00696992-v
part of speech: verb

00696992-v
type: LexicalConcept
in scheme: en-word.net
definition: fix or determine the value of; assign a value to
example: value the jewelry and art work in the estate
ili: i25186
lexfile: verb.cognition
part of speech: verb
hypernym: 00701581-v