justice-n
type: LexicalEntry
canonical form: justice
sense: 00695934-n
part of speech: noun

00695934-n
type: LexicalConcept
in scheme: en-word.net
definition: judgment involved in the determination of rights and the assignment of rewards and punishments
ili: i39086
lexfile: noun.act
part of speech: noun
hypernym: 00875745-n