identify-v
type: LexicalEntry
canonical form: identify
sense: 00693710-v
part of speech: verb

00693710-v
type: LexicalConcept
in scheme: en-word.net
definition: consider (oneself) as similar to somebody else
example: He identified with the refugees
ili: i25170
lexfile: verb.cognition
part of speech: verb
hypernym: 00692380-v