censor-v
type: LexicalEntry
canonical form: censor
sense: 00684847-v
part of speech: verb

00684847-v
type: LexicalConcept
in scheme: en-word.net
definition: subject to political, religious, or moral censorship
example: This magazine is censored by the government
ili: i25130
lexfile: verb.cognition
part of speech: verb
hypernym: 00683348-v