plump-v
type: LexicalEntry
canonical form: plump
sense: 00678186-v
part of speech: verb

go-v
type: LexicalEntry
canonical form: go
sense: 00678186-v
part of speech: verb

00678186-v
type: LexicalConcept
in scheme: en-word.net
definition: give support (to) or make a choice (of) one out of a group or number
example: I plumped for the losing candidates
ili: i25098
lexfile: verb.cognition
part of speech: verb
hypernym: 00676526-v