medication-n
type: LexicalEntry
canonical form: medication
sense: 00665353-n
part of speech: noun

00665353-n
type: LexicalConcept
in scheme: en-word.net
definition: the act of treating with medicines or remedies
ili: i38913
lexfile: noun.act
part of speech: noun
hypernym: 00662334-n