seed-v
type: LexicalEntry
canonical form: seed
sense: 00660584-v
part of speech: verb

00660584-v
type: LexicalConcept
in scheme: en-word.net
definition: distribute (players or teams) so that outstanding teams or players will not meet in the early rounds
ili: i25019
lexfile: verb.cognition
part of speech: verb
domain topic: 00524569-n
hypernym: 00659723-v