crucial-a
type: LexicalEntry
canonical form: crucial
sense: https://en-word.net/lemma/crucial-a#00658802-a
part of speech: adjective

important-a
type: LexicalEntry
canonical form: important
sense: https://en-word.net/lemma/important-a#00658802-a
part of speech: adjective

https://en-word.net/synset/00658802-a
type: LexicalConcept
in scheme: en-word.net
definition: of extreme importance; vital to the resolution of a crisis
example: a crucial moment in his career
example: a crucial election
example: a crucial issue for women
ili: i3644
lexfile: adj.all
part of speech: adjective
also: https://en-word.net/synset/00653599-a
also: https://en-word.net/synset/00687757-a
also: https://en-word.net/synset/00903909-a
similar: 00659155-s
similar: 00659407-s
similar: 00659530-s