refer-v
type: LexicalEntry
canonical form: refer
sense: 00657226-v
part of speech: verb

00657226-v
type: LexicalConcept
in scheme: en-word.net
definition: think of, regard, or classify under a subsuming principle or with a general group or in relation to another
example: This plant can be referred to a known species
ili: i25004
lexfile: verb.cognition
part of speech: verb
hypernym: 00656296-v